{"text_format":"1","workbook":"xlsx","n_sheets":12,"sheets":["ข้อมูลพื้นฐาน","บุคลากร","จัดบุคลากร","ลงทะเบียน","ปก","ตัวชี้วัด","เวลาเรียน","บันทักคะแนน","คำอธิบายรายวิชา","กำหนดชิ้นงาน","ปกหลัง","รายชื่อนักเรียน"],"not_rendered":{"charts":0,"images":10,"macros":1,"external_links":0,"defined_names":14,"comments":0,"pivot_tables":0},"unopened":[],"bounds":{"document_bytes":16777216,"sheet_cells":100000,"rows_first":2000,"rows_last":500,"rows_between":2000,"halvings":0,"cell_chars":16384,"cell_head_chars":4096},"cells_cut":0,"cells_raw":0,"read":"whole","date_system":"1900"}

{"sheet":"ข้อมูลพื้นฐาน","index":0,"n_rows":47,"n_cols":27,"rows_kept":47,"cut":false,"hidden":false,"merged":[[22,2,22,3],[22,4,22,7],[19,10,19,13],[20,10,20,13],[21,10,21,13],[21,2,21,3],[21,4,21,7],[22,10,23,13],[16,9,16,10],[17,2,17,13],[18,2,18,3],[19,2,19,3],[20,2,20,3],[19,4,19,7],[20,4,20,7],[18,4,18,5],[4,4,4,13],[5,4,5,13],[6,4,6,13],[12,9,12,11],[12,6,12,7],[8,4,8,7],[9,4,9,7],[10,2,10,13],[13,2,13,3],[15,2,15,3],[11,6,11,13],[12,12,12,13],[15,10,15,13],[13,10,13,13],[14,4,14,7],[14,10,14,13],[11,2,11,3],[12,2,12,3],[0,1,2,9],[1,10,1,13],[2,10,2,13],[22,14,23,17],[3,2,3,13],[7,10,7,13],[8,10,8,13],[9,10,9,13],[7,4,7,7],[4,2,4,3],[5,2,5,3],[6,2,6,3],[7,2,7,3],[8,2,8,3],[9,2,9,3],[15,4,15,7]]}
[null,"โปรแกรมจัดทำ ปพ : 5 ด้วย MS-Excel",null,null,null,null,null,null,null,null,"ออกแบบและพัฒนา โดย"]
[null,null,null,null,null,null,null,null,null,null,"นายเกรียงศักดิ์  โกบสันเทียะ"]
[null,null,null,null,null,null,null,null,null,null,"ครู ชำนาญการพิเศษ โรงเรียนสมเสม็ดวิทยา",null,null,null,null,null,null,null,"คู่มือการใช้งานเบื้องต้น"]
[null,null,"ข้อมูลพื้นฐานสถานศึกษา",null,null,null,null,null,null,null,null,null,null,null,null,null,null,null,"ส่วนที่ 1 ข้อมูลสถานศึกษา"]
[null,null,"โรงเรียน",null,"สมเสม็ดวิทยา",null,null,null,null,null,null,null,null,null,null,null,null,null,"-","คลิกเลือกชื่อหัวหน้างานวัดผล"]
[null,null,"สังกัด/เขตพื้นที่",null,"สำนักงานเขตพื้นที่การศึกษามัธยมศึกษา เขต 32",null,null,null,null,null,null,null,null,null,null,null,null,null,"-","คลิกเลือกชื่อหัวหน้ากลุ่มวิชาการ"]
[null,null,"ที่อยู่",null,"175 หมู่ 5 ตำบลชุมแสง อำเภอสตึก จังหวัดบุรีรัมย์",null,null,null,null,null,null,null,null,null,null,null,null,null,"-","คลิกเลือกชื่อผู้อำนวยการ"]
[null,null,"ผู้อำนวยการ",null,"นางสาววรินทร  ปัดกอง",null,null,null,null,"ตำแหน่ง",{"$f":"IF(E8=\"\",\"\",VLOOKUP(E8,บุคลากร!$E$11:$G$52,3,FALSE))","v":"ผู้อำนวยการ"}]
{"$rows_left_out":40}
{"sheet":"บุคลากร","index":1,"n_rows":72,"n_cols":7,"rows_kept":72,"cut":false,"hidden":false,"merged":[[6,2,6,6],[7,2,7,6],[1,2,2,6]]}
[]
[null,null,"เมื่อเพิ่มรายชื่อบุคลากรแล้ว ให้กด ctrl+r เพื่อจัดเรียงรายชื่อใหม่"]
[]
[]
[]
[]
[null,null,{"$f":"\"รายชื่อบุคลากร  โรงเรียน\"&ข้อมูลพื้นฐาน!E5&\" \"","v":"รายชื่อบุคลากร  โรงเรียนสมเสม็ดวิทยา "}]
[null,null,{"$f":"ข้อมูลพื้นฐาน!E6","v":"สำนักงานเขตพื้นที่การศึกษามัธยมศึกษา เขต 32"}]
{"$rows_left_out":65}
{"sheet":"จัดบุคลากร","index":2,"n_rows":56,"n_cols":14,"rows_kept":56,"cut":false,"hidden":false,"merged":[[6,2,6,5],[7,2,7,5],[23,2,24,5],[47,2,49,2],[50,2,52,2],[53,2,55,2],[25,2,25,5],[27,2,28,2],[27,3,27,5],[29,2,31,2],[32,2,34,2],[35,2,37,2],[27,8,28,8],[27,11,27,13],[38,2,40,2],[41,2,43,2],[44,2,46,2]]}
[]
[]
[]
[]
[]
[]
[null,null,{"$f":"\"หัวหน้ากลุ่มสาระ  โรงเรียน\"&ข้อมูลพื้นฐาน!E5&\" \"","v":"หัวหน้ากลุ่มสาระ  โรงเรียนสมเสม็ดวิทยา "}]
[null,null,{"$f":"ข้อมูลพื้นฐาน!E6","v":"สำนักงานเขตพื้นที่การศึกษามัธยมศึกษา เขต 32"}]
{"$rows_left_out":49}
{"sheet":"ลงทะเบียน","index":3,"n_rows":60,"n_cols":12,"rows_kept":60,"cut":false,"hidden":false,"merged":[[0,1,1,6],[4,1,4,8],[5,1,5,8],[6,1,6,8]]}
[null,"       การงานเพิ่มเติมและกิจกรรมชุมนุมต้องไปจัดนักเรียนเข้าห้องก่อนนะครับ"]
[]
[]
[]
[null,{"$f":"\"โรงเรียน\"&ข้อมูลพื้นฐาน!E5","v":"โรงเรียนสมเสม็ดวิทยา"}]
[null,{"$f":"ข้อมูลพื้นฐาน!E6","v":"สำนักงานเขตพื้นที่การศึกษามัธยมศึกษา เขต 32"}]
[null,{"$f":"\"รายชื่อนักเรียน  ระดับชั้น  \"&ข้อมูลพื้นฐาน!E19&\"  ห้อง \"&ข้อมูลพื้นฐาน!H19&\"  ปีการศึกษา  \"&ข้อมูลพื้นฐาน!G13&\"  ภาคเรียนที่  \"&ข้อมูลพื้นฐาน!E13","v":"รายชื่อนักเรียน  ระดับชั้น    ห้อง   ปีการศึกษา    ภาคเรียนที่  "}]
[null,"เลขที่","เลขประจำตัวนักเรียน",null,"ชื่อ - สกุล",null,"ห้อง",null,"สถานภาพนักเรียน\nอออ/ย้าย"]
{"$rows_left_out":53}
{"sheet":"ปก","index":4,"n_rows":47,"n_cols":31,"rows_kept":47,"cut":false,"hidden":false,"merged":[[15,27,15,29],[15,15,15,16],[15,17,15,19],[15,23,15,26],[15,30,15,31],[46,14,46,22],[39,14,39,22],[41,14,41,22],[11,2,11,32],[18,30,18,31],[15,8,15,14],[17,9,17,21],[18,9,18,14],[18,18,18,21],[18,26,18,29],[16,3,16,7],[15,3,15,7],[17,3,17,7],[18,3,18,7],[19,3,19,7],[18,15,18,17],[19,9,19,31],[30,11,30,12],[31,11,31,12],[31,24,31,25],[30,27,30,28],[31,27,31,28],[29,18,29,20],[29,21,29,23],[29,24,29,26],[29,27,29,29],[35,14,35,22],[37,14,37,22],[30,24,30,25],[31,5,31,6],[30,8,30,9],[31,8,31,9],[30,14,30,15],[30,5,30,6],[31,14,31,15],[30,18,30,19],[31,18,31,19],[31,21,31,22],[25,16,25,17],[25,26,25,27],[25,24,25,25],[20,8,20,18],[20,20,20,31],[21,20,21,31],[28,5,28,16],[28,18,28,29],[29,11,29,13],[29,8,29,10],[26,30,26,31],[26,24,26,25],[26,26,26,27],[29,5,29,7],[29,14,29,16],[26,3,26,5],[26,6,26,7],[26,8,26,9],[26,10,26,11],[26,12,26,13],[7,28,8,32],[24,14,24,15],[24,16,24,17],[44,14,44,22],[9,3,9,31],[30,21,30,22],[43,14,43,22],[24,20,24,21],[24,22,24,23],[24,24,24,25],[24,26,24,27],[25,6,25,7],[25,8,25,9],[25,10,25,11],[25,12,25,13],[34,14,34,22],[36,14,36,22],[26,14,26,15],[26,18,26,19],[26,20,26,21],[26,22,26,23],[13,2,13,32],[17,25,17,31],[16,9,16,31],[38,14,38,22],[45,9,45,27],[40,14,40,22],[12,2,12,32],[25,18,25,19],[25,22,25,23],[25,20,25,21],[18,22,18,25],[26,16,26,17],[24,3,25,5],[25,28,25,29],[25,30,25,31],[24,30,24,31],[26,28,26,29],[24,18,24,19],[24,28,24,29],[23,3,23,5],[24,6,24,7],[24,8,24,9],[24,10,24,11],[24,12,24,13],[23,6,23,21],[23,22,23,31],[25,14,25,15]]}
[]
[]
[]
[]
[]
[]
[]
[null,null,null,null,null,null,null,null,null,null,null,null,null,null,null,null,null,null,null,null,null,null,null,null,null,null,null,null,{"$f":"IF(I16=\"\",\"\",IF(I16=\"มัธยมศึกษาปีที่ 1 - 6\",\"ปพ.5\",IF(I16=\"มัธยมศึกษาปีที่ 1\",\"ปพ.5 : บ\",IF(I16=\"มัธยมศึกษาปีที่ 2\",\"ปพ.5 : บ\",IF(I16=\"มัธยมศึกษาปีที่ 3\",\"ปพ.5 : บ\",IF(I16=\"มัธยมศึกษาปีที่ 4\",\"ปพ.5 : พ\",IF(I16=\"มัธยมศึกษาปีที่ 5\",\"ปพ.5 : พ\",IF(I16=\"มัธยมศึกษาปีที่ 6\",\"ปพ.5 : พ\",))))))))","v":""}]
{"$rows_left_out":40}
{"sheet":"ตัวชี้วัด","index":5,"n_rows":20,"n_cols":12,"rows_kept":20,"cut":false,"hidden":false,"merged":[[6,4,6,5],[7,4,7,5],[6,6,6,8],[7,6,7,8],[8,1,8,8],[10,1,10,8],[12,1,14,1],[12,2,14,2],[12,4,13,4],[12,3,14,3],[12,5,12,8]]}
[]
[]
[]
[]
[]
[]
[null,null,"รายวิชา",{"$f":"IF(ปก!J18=\"\",\"\",ปก!J18)","v":""},"รหัสวิชา",null,{"$f":"IF(ปก!$Z$18=\"\",\"\",(ปก!$Z$18))","v":""}]
[null,null,"กลุ่มสาระการเรียนรู้",{"$f":"IF(ปก!J17=\"\",\"\",ปก!J17)","v":""},"ระดับชั้น",null,{"$f":"IF(ปก!I16=\"\",\"\",ปก!I16)","v":""}]
{"$rows_left_out":13}
{"sheet":"เวลาเรียน","index":6,"n_rows":54,"n_cols":119,"rows_kept":54,"cut":false,"hidden":false,"merged":[[17,111,17,114],[18,111,18,114],[19,111,19,114],[25,111,25,114],[32,3,32,4],[33,3,33,4],[34,3,34,4],[26,3,26,4],[6,95,6,99],[6,100,6,104],[6,106,7,109],[6,110,6,114],[7,95,7,99],[7,100,7,104],[7,110,7,113],[11,111,11,114],[31,111,31,114],[8,106,10,106],[8,107,10,107],[8,108,10,108],[8,109,10,109],[8,110,8,113],[9,110,9,113],[12,111,12,114],[13,111,13,114],[14,111,14,114],[15,111,15,114],[16,111,16,114],[6,80,6,84],[6,85,6,89],[6,90,6,94],[7,50,7,54],[7,55,7,59],[7,60,7,64],[7,65,7,69],[7,70,7,74],[7,75,7,79],[7,80,7,84],[7,85,7,89],[7,90,7,94],[6,50,6,54],[6,55,6,59],[6,60,6,64],[27,3,27,4],[28,3,28,4],[29,3,29,4],[52,3,52,4],[53,3,53,4],[45,3,45,4],[46,3,46,4],[47,3,47,4],[48,3,48,4],[49,3,49,4],[30,3,30,4],[50,3,50,4],[51,3,51,4],[40,3,40,4],[41,3,41,4],[42,3,42,4],[43,3,43,4],[44,3,44,4],[35,3,35,4],[36,3,36,4],[37,3,37,4],[38,3,38,4],[39,3,39,4],[31,3,31,4],[6,1,10,1],[6,2,10,2],[6,15,6,19],[6,5,6,9],[12,3,12,4],[6,10,6,14],[11,3,11,4],[6,3,10,3],[24,3,24,4],[15,3,15,4],[16,3,16,4],[17,3,17,4],[13,3,13,4],[14,3,14,4],[23,3,23,4],[18,3,18,4],[19,3,19,4],[20,3,20,4],[21,3,21,4],[22,3,22,4],[20,111,20,114],[21,111,21,114],[22,111,22,114],[23,111,23,114],[24,111,24,114],[6,45,6,49],[7,45,7,49],[25,3,25,4],[6,20,6,24],[6,25,6,29],[7,5,7,9],[7,10,7,14],[7,15,7,19],[7,20,7,24],[7,25,7,29],[7,40,7,44],[6,30,6,34],[6,35,6,39],[6,40,6,44],[7,30,7,34],[7,35,7,39],[6,65,6,69],[6,70,6,74],[6,75,6,79]]}
[]
[]
[]
[]
[]
[]
[null,"เลขที่","เลขประจำตัว","ชื่อ - สกุล","สัปดาห์",1,null,null,null,null,2,null,null,null,null,3,null,null,null,null,4,null,null,null,null,5,null,null,null,null,6,null,null,null,null,7,null,null,null,null,8,null,null,null,null,9,null,null,null,null,10,null,null,null,null,11,null,null,null,null,12,null,null,null,null,13,null,null,null,null,14,null,null,null,null,15,null,null,null,null,16,null,null,null,null,17,null,null,null,null,18,null,null,null,null,19,null,null,null,null,20,null,null,null,null,null,"       สรุปเวลาเรียน     (ชั่วโมง)",null,null,null,"การนับเวลาเรียนของนักเรียน"]
[null,null,null,null,"เดือน","พฤศจิกายน",null,null,null,null,null,null,null,null,null,null,null,null,null,null,null,null,null,null,null,null,null,null,null,null,null,null,null,null,null,null,null,null,null,null,null,null,null,null,null,null,null,null,null,null,null,null,null,null,null,null,null,null,null,null,null,null,null,null,null,null,null,null,null,null,null,null,null,null,null,null,null,null,null,null,null,null,null,null,null,null,null,null,null,null,null,null,null,null,null,null,null,null,null,null,null,null,null,null,null,null,null,null,null,null,"จำนวนชั่วโมงทั้งหมดต่อภาค",null,null,null,{"$f":"IF(ปก!S19=\"\",\"\",(ปก!S19*20))","v":""}]
{"$rows_left_out":47}
{"sheet":"บันทักคะแนน","index":7,"n_rows":52,"n_cols":107,"rows_kept":52,"cut":false,"hidden":false,"merged":[[7,102,8,102],[7,103,8,103],[7,104,8,104],[5,78,5,80],[7,97,8,97],[7,98,8,98],[7,99,8,99],[7,100,8,100],[7,101,8,101],[5,97,5,105],[6,78,7,78],[6,79,7,79],[6,80,7,80],[6,81,7,81],[6,82,7,82],[6,83,7,83],[6,90,6,94],[6,95,8,95],[6,97,6,104],[6,105,8,105],[7,90,8,90],[7,91,8,91],[7,92,8,92],[7,93,8,93],[7,94,8,94],[5,81,5,83],[5,84,7,84],[5,86,7,86],[5,87,8,87],[5,90,5,95],[6,69,6,70],[6,71,7,71],[6,73,6,74],[6,75,7,75],[5,69,5,71],[5,73,5,75],[5,88,8,88],[6,59,7,59],[6,61,6,62],[6,63,7,63],[6,65,6,66],[6,67,7,67],[5,41,5,43],[5,45,5,47],[5,49,5,51],[5,53,5,55],[5,57,5,59],[5,61,5,63],[5,65,5,67],[6,41,6,42],[6,43,7,43],[6,45,6,46],[6,47,7,47],[6,49,6,50],[6,51,7,51],[6,53,6,54],[6,55,7,55],[6,57,6,58],[5,12,5,14],[6,12,6,13],[6,14,7,14],[5,32,5,34],[6,32,6,33],[5,36,5,38],[6,36,6,37],[6,38,7,38],[5,20,5,22],[6,20,6,21],[6,22,7,22],[5,24,5,26],[6,24,6,25],[6,26,7,26],[5,28,5,30],[6,28,6,29],[6,30,7,30],[6,34,7,34],[5,16,5,18],[6,16,6,17],[6,18,7,18],[5,1,8,1],[5,2,7,3],[21,2,21,3],[23,2,23,3],[10,2,10,3],[11,2,11,3],[12,2,12,3],[13,2,13,3],[14,2,14,3],[15,2,15,3],[16,2,16,3],[17,2,17,3],[18,2,18,3],[19,2,19,3],[22,2,22,3],[20,2,20,3],[6,6,7,6],[5,4,5,6],[5,8,5,10],[6,8,6,9],[34,2,34,3],[35,2,35,3],[36,2,36,3],[37,2,37,3],[33,2,33,3],[24,2,24,3],[25,2,25,3],[26,2,26,3],[27,2,27,3],[28,2,28,3],[29,2,29,3],[30,2,30,3],[31,2,31,3],[32,2,32,3],[9,2,9,3],[6,10,7,10],[6,4,6,5],[38,2,38,3],[39,2,39,3],[40,2,40,3],[41,2,41,3],[42,2,42,3],[43,2,43,3],[44,2,44,3],[45,2,45,3],[51,2,51,3],[50,2,50,3],[46,2,46,3],[47,2,47,3],[48,2,48,3],[49,2,49,3]]}
[]
[]
[]
[]
[null,null,null,null,{"$f":"(\"การประเมินผลการเรียน  อัตราส่วนคะแนน  ระหว่างภาค  :  ปลายภาค  =  \"&ตัวชี้วัด!$E$11)","v":"การประเมินผลการเรียน  อัตราส่วนคะแนน  ระหว่างภาค  :  ปลายภาค  =  "},null,null,null,null,null,null,null,null,null,null,null,null,null,null,null,null,null,null,null,null,null,null,null,null,null,null,null,null,null,{"$f":"IF(ข้อมูลพื้นฐาน!$J$17=\"\",\"\",ข้อมูลพื้นฐาน!$J$17)","v":"70 : 30"},null,null,null,null,null,null,{"$f":"(\"การประเมินผลการเรียน  อัตราส่วนคะแนน  ระหว่างภาค  :  ปลายภาค  =  \"&ตัวชี้วัด!$E$11)","v":"การประเมินผลการเรียน  อัตราส่วนคะแนน  ระหว่างภาค  :  ปลายภาค  =  "},null,null,null,null,null,null,null,null,null,null,null,null,null,null,null,null,null,null,null,null,null,null,null,null,null,null,null,null,null,{"$f":"IF(ข้อมูลพื้นฐาน!$J$17=\"\",\"\",ข้อมูลพื้นฐาน!$J$17)","v":"70 : 30"},null,null,null,null,null,null,{"$f":"(\"การประเมินผลการเรียน  อัตราส่วนคะแนน  ระหว่างภาค  :  ปลายภาค  =  \"&ตัวชี้วัด!$E$11)","v":"การประเมินผลการเรียน  อัตราส่วนคะแนน  ระหว่างภาค  :  ปลายภาค  =  "},null,null,null,null,null,null,null,null,null,null,null,null,null,null,null,null,null,null,null,null,{"$f":"IF(ข้อมูลพื้นฐาน!$J$17=\"\",\"\",ข้อมูลพื้นฐาน!$J$17)","v":"70 : 30"}]
[null,"เลขที่","ชื่อ - สกุล",null,null,null,null,null,null,null,null,null,null,null,null,null,null,null,null,null,null,null,null,null,null,null,null,null,null,null,null,null,null,null,null,null,null,null,null,null,"รวม",null,null,null,null,null,null,null,null,null,null,null,null,null,null,null,null,null,null,null,null,null,null,null,null,null,null,null,null,null,null,null,null,null,null,null,null,"รวม","คะแนนหน่วย",null,null,"กลางภาค",null,null,"ปลายภาค",null,"คะแนน\nทั้งหมด","ระดับผลการเรียน","บันทึกเกรด \"ร\"",null,"อ่าน คิด วิเคราะห์ เขียน",null,null,null,null,null,null,"คะแนนคุณลักษณะฯ",null,null,null,null,null,null,null,null,"ตัวชี้วัดที่ 1"]
[null,null,null,null,"ครั้งที่",null,"รวม",null,"ครั้งที่",null,"รวม",null,"ครั้งที่",null,"รวม",null,"ครั้งที่",null,"รวม",null,"ครั้งที่",null,"รวม",null,"ครั้งที่",null,"รวม",null,"ครั้งที่",null,"รวม",null,"ครั้งที่",null,"รวม",null,"ครั้งที่",null,"รวม",null,"ก่อน","ครั้งที่",null,"รวม",null,"ครั้งที่",null,"รวม",null,"ครั้งที่",null,"รวม",null,"ครั้งที่",null,"รวม",null,"ครั้งที่",null,"รวม",null,"ครั้งที่",null,"รวม",null,"ครั้งที่",null,"รวม",null,"ครั้งที่",null,"รวม",null,"ครั้งที่",null,"รวม",null,"หลัง","ก่อน","หลัง","รวม","สอบ","แก้ตัว","ได้",null,null,null,null,null,null,"ประเมิน ข้อที่",null,null,null,null,"ผลประเมิน",null,"ประเมิน ข้อที่",null,null,null,null,null,null,null,"ผลประเมิน","ตัวชี้วัดที่ 2"]
[null,null,null,null,1,2,null,null,1,2,null,null,1,2,null,null,1,2,null,null,1,2,null,null,1,2,null,null,1,2,null,null,1,2,null,null,1,2,null,null,"กลางภาค",1,2,null,null,1,2,null,null,1,2,null,null,1,2,null,null,1,2,null,null,1,2,null,null,1,2,null,null,1,2,null,null,1,2,null,null,"กลางภาค",null,null,null,null,null,null,null,null,null,null,null,null,1,2,3,4,5,null,null,1,2,3,4,5,6,7,8,null,"ตัวชี้วัดที่ 3"]
{"$rows_left_out":45}
{"sheet":"คำอธิบายรายวิชา","index":8,"n_rows":52,"n_cols":26,"rows_kept":52,"cut":false,"hidden":false,"merged":[[7,1,7,19],[13,2,36,18],[11,5,11,6],[10,15,10,16],[11,15,11,16],[12,2,12,18],[10,9,10,10],[10,11,10,12],[10,4,10,8],[9,9,9,12],[9,4,9,8],[9,13,9,18],[8,4,8,11],[8,15,8,18]]}
[]
[]
[]
[]
[]
[]
[]
[null,"คำอธิบายรายวิชา"]
{"$rows_left_out":45}
{"sheet":"กำหนดชิ้นงาน","index":9,"n_rows":30,"n_cols":7,"rows_kept":30,"cut":false,"hidden":false,"merged":[[24,3,24,4],[29,3,29,4],[6,1,6,6]]}
[]
[]
[]
[]
[]
[]
[null,"การกำหนดชิ้นงาน / งาน / โครงงาน / แบบฝึกหัด ประกอบการเรียนรู้และวัดประเมินผล"]
[]
{"$rows_left_out":23}
{"sheet":"ปกหลัง","index":10,"n_rows":55,"n_cols":11,"rows_kept":55,"cut":false,"hidden":false,"merged":[[17,7,17,8],[18,7,18,8],[19,2,19,6],[22,2,22,6],[23,2,23,6],[24,2,24,6],[25,2,25,6],[17,2,18,6],[48,1,48,4],[17,1,18,1],[49,1,49,4],[50,1,50,4],[51,1,51,4],[48,5,48,8],[49,5,49,8],[50,5,50,8],[51,5,51,8],[7,1,7,2],[7,3,7,4],[7,5,7,6],[47,1,47,4],[47,5,47,8],[26,2,26,6],[19,7,19,8],[20,7,20,8],[21,7,21,8],[22,7,22,8],[23,7,23,8],[24,7,24,8],[25,7,25,8],[26,7,26,8],[20,2,20,6],[21,2,21,6],[7,7,7,8],[8,7,8,8],[10,7,10,8],[11,7,11,8],[12,7,12,8],[13,7,13,8],[14,7,14,8],[10,1,10,2],[10,3,10,4],[10,5,10,6],[11,1,11,2],[11,3,11,4],[11,5,11,6],[12,1,12,2],[12,3,12,4],[12,5,12,6],[6,1,6,8],[16,1,16,8],[28,1,28,8],[37,1,37,8],[8,1,8,2],[8,3,8,4],[8,5,8,6],[9,1,9,2],[9,3,9,4],[9,5,9,6],[13,1,13,2],[13,3,13,4],[13,5,13,6],[14,1,14,2],[14,3,14,4],[14,5,14,6]]}
[]
[]
[]
[]
[]
[]
[null,"การนับเวลาเรียน",null,null,null,null,null,null,null,null,"รายการประเมินคุณลักษณะอันพึงประสงค์ของผู้เรียน"]
[null,"จำนวนชั่วโมง",null,"จำนวนชั่วโมง",null,"เวลาเรียน",null,"เวลาเรียน",null,null,"\u008c รักชาติ ศาสน์ กษัตริย์"]
{"$rows_left_out":48}
{"sheet":"รายชื่อนักเรียน","index":11,"n_rows":49,"n_cols":56,"rows_kept":49,"cut":false,"hidden":false,"merged":[[5,55,5,59],[5,31,5,34],[5,1,5,4],[5,7,5,10],[5,13,5,16],[5,19,5,22],[5,25,5,28],[5,37,5,40],[5,43,5,46],[5,49,5,52]]}
[]
[]
[]
[]
[]
[null,"มัธยมศึกษาปีที่ 1 ห้อง 1",null,null,null,"ห้อง",null,"มัธยมศึกษาปีที่ 1 ห้อง 2",null,null,null,"ห้อง",null,"มัธยมศึกษาปีที่ 2 ห้อง 1",null,null,null,"ห้อง",null,"มัธยมศึกษาปีที่ 2 ห้อง 2",null,null,null,"ห้อง",null,"มัธยมศึกษาปีที่ 3 ห้อง 1",null,null,null,"ห้อง",null,"มัธยมศึกษาปีที่ 3 ห้อง 2",null,null,null,"ห้อง",null,"มัธยมศึกษาปีที่ 4",null,null,null,"ห้อง",null,"มัธยมศึกษาปีที่ 5",null,null,null,"ห้อง",null,"มัธยมศึกษาปีที่ 6",null,null,null,"ห้อง",null,"กิจกรรมชุมนุม"]
[null,1,"01644","เด็กชายกิตติศักดิ์  ไชยปัญญา",null,"ม.1-1",null,1,"01671","เด็กชายกฤตกร  ยอดรัก",null,"ม.1-2",null,1,1594,"เด็กชายจิรเดช  เจ็ดรัมย์",null,"ม.2-1",null,1,1593,"เด็กชายกฤษณะ  เจียรัมย์",null,"ม2-2",null,1,1545,"เด็กชายกวิน  ถะเกิงสุข",null,"ม3-1",null,1,1548,"เด็กชายณัฐวุฒิ  สุขจิตต์",null,"ม3-2",null,1,1512,"นายพงศ์ภัค  ดีบัว",null,"ม.4",null,1,1445,"นายคมสันต์  ศรีปัญญา",null,"ม.5-1",null,1,1449,"นายธนาวุฒิ  สุขจิตต์",null,"ม.6-1",null,1]
[null,2,"01645","เด็กชายธีรเดช  ดียิ่ง",null,"ม.1-1",null,2,"01672","เด็กชายกฤษณะ  ถะเกิงสุข",null,"ม.1-2",null,2,1597,"เด็กชายธนพงศ์  ไพรศรี",null,"ม.2-1",null,2,1595,"เด็กชายเจนภพ  บุศราคัม",null,"ม2-2",null,2,1546,"เด็กชายกิตติกร  กระแสโสม",null,"ม3-1",null,2,1549,"เด็กชายเด่นชัย  ชินรัมย์",null,"ม3-2",null,2,1519,"นางสาวกัลยา  แสนจันทร์",null,"ม.4",null,2,"01472","นายเจษฎา  แก้วมณี",null,"ม.5-1",null,2,1451,"นายภีรพงษ์  ศรีสุข",null,"ม.6-1",null,2]
{"$rows_left_out":41}